Target
Stromelysin-1
Ligand
BDBM50343087
Substrate
Meas. Tech.
ChEMBL_744951 (CHEMBL1771910)
Ki
130±n/a nM
Citation
 Barta, TEBecker, DPBedell, LJEaston, AMHockerman, SLKiefer, JMunie, GEMathis, KJLi, MHRico, JGVillamil, CIWilliams, JM MMP-13 selectivea-sulfone hydroxamates: a survey of P1' heterocyclic amide isosteres. Bioorg Med Chem Lett 21:2820-2 (2011)  
Target
Name:
Stromelysin-1
Synonyms:
MMP-3 MMP3_HUMAN Matrix metalloproteinase 3 Matrix metalloproteinase-3 (MMP-3) SL-1 Stromelysin 1 | Transin-1
Type:
Enzyme
Mol. Mass.:
53973.13
Organism:
Homo sapiens (Human)
Description:
P08254
Residue:
477
  
Inhibitor
Name:
BDBM50343087
Synonyms:
CHEMBL1771222 | N-hydroxy-4-(4-(3-(5-(4-(trifluoromethoxy)phenyl)-1H-imidazol-1-yl)propoxy)phenylsulfonyl)tetrahydro-2H-pyran-4-carboxamide
Type:
Small organic molecule
Emp. Form.:
C25H26F3N3O7S
Mol. Mass.:
569.55
SMILES:
ONC(=O)C1(CCOCC1)S(=O)(=O)c1ccc(OCCCn2cncc2-c2ccc(OC(F)(F)F)cc2)cc1
: