Target
Collagenase 3
Ligand
BDBM50343081
Substrate
Meas. Tech.
ChEMBL_744955 (CHEMBL1771914)
Ki
0.130000±n/a nM
Citation
 Barta, TEBecker, DPBedell, LJEaston, AMHockerman, SLKiefer, JMunie, GEMathis, KJLi, MHRico, JGVillamil, CIWilliams, JM MMP-13 selectivea-sulfone hydroxamates: a survey of P1' heterocyclic amide isosteres. Bioorg Med Chem Lett 21:2820-2 (2011)  
Target
Name:
Collagenase 3
Synonyms:
MMP-13 MMP13_HUMAN Matrix metalloproteinase-13 (MMP-13) | Matrix metalloproteinase-13 (MMP13)
Type:
Enzyme
Mol. Mass.:
53808.06
Organism:
Homo sapiens (Human)
Description:
P45452
Residue:
471
  
Inhibitor
Name:
BDBM50343081
Synonyms:
CHEMBL1771216 | N-hydroxy-1-(2-methoxyethyl)-4-(4-(3-(5-(4-(trifluoromethoxy)phenyl)-2H-tetrazol-2-yl)propoxy)phenylsulfonyl)piperidine-4-carboxamide
Type:
Small organic molecule
Emp. Form.:
C26H31F3N6O7S
Mol. Mass.:
628.621
SMILES:
COCCN1CCC(CC1)(C(=O)NO)S(=O)(=O)c1ccc(OCCCn2nnc(n2)-c2ccc(OC(F)(F)F)cc2)cc1
: