Target
Adenosine receptor A3
Ligand
BDBM50053925
Substrate
Meas. Tech.
ChEMBL_744131 (CHEMBL1771830)
Ki
3.03±n/a nM
Citation
 Cheong, SLFederico, SVenkatesan, GPaira, PShao, YMSpalluto, GYap, CWPastorin, G Pharmacophore elucidation for a new series of 2-aryl-pyrazolo-triazolo-pyrimidines as potent human A3 adenosine receptor antagonists. Bioorg Med Chem Lett 21:2898-905 (2011)  
Target
Name:
Adenosine receptor A3
Synonyms:
A3 adenosine receptor (hA3) ADORA3 | Adenosine A3 receptor (A3AR)
Type:
G Protein-Coupled Receptor (GPCR)
Mol. Mass.:
36197.32
Organism:
Homo sapiens (Human)
Description:
P0DMS8
Residue:
318
  
Inhibitor
Name:
BDBM50053925
Synonyms:
CHEMBL317382 N-(9-chloro-2-(furan-2-yl)-[1,2,4]triazolo[1,5-c]quinazolin-5-yl)benzamide
Type:
Small organic molecule
Emp. Form.:
C20H12ClN5O2
Mol. Mass.:
389.795
SMILES:
Clc1ccc2nc(NC(=O)c3ccccc3)n3nc(nc3c2c1)-c1ccco1
: