Target
5-hydroxytryptamine receptor 2A
Ligand
BDBM50343272
Substrate
Meas. Tech.
ChEMBL_745648 (CHEMBL1776018)
Ki
1.4±n/a nM
Citation
 Johnson, DSChoi, CFay, LKFavor, DARepine, JTWhite, ADAkunne, HCFitzgerald, LNicholls, KSnyder, BJWhetzel, SZZhang, LSerpa, KA Discovery of PF-00217830: aryl piperazine napthyridinones as D2 partial agonists for schizophrenia and bipolar disorder. Bioorg Med Chem Lett 21:2621-5 (2011)  
Target
Name:
5-hydroxytryptamine receptor 2A
Synonyms:
5-HT-2 5-HT2A 5-hydroxytryptamine receptor 2A (5HT-2A) 5HT2A_HUMAN HTR2A | Serotonin receptor 2A
Type:
undefined
Mol. Mass.:
52607.65
Organism:
Homo sapiens (Human)
Description:
P28223
Residue:
471
  
Inhibitor
Name:
BDBM50343272
Synonyms:
7-(4-(4-(3-chloro-2-(trifluoromethyl)phenyl)piperazin-1-yl)butoxy)-3,4-dihydro-1,8-naphthyridin-2(1H)-one | CHEMBL1774075
Type:
Small organic molecule
Emp. Form.:
C23H26ClF3N4O2
Mol. Mass.:
482.926
SMILES:
FC(F)(F)c1c(Cl)cccc1N1CCN(CCCCOc2ccc3CCC(=O)Nc3n2)CC1
: