Target
5-hydroxytryptamine receptor 1A
Ligand
BDBM50343283
Substrate
Meas. Tech.
ChEMBL_745649 (CHEMBL1776019)
Ki
1.1±n/a nM
Citation
 Johnson, DSChoi, CFay, LKFavor, DARepine, JTWhite, ADAkunne, HCFitzgerald, LNicholls, KSnyder, BJWhetzel, SZZhang, LSerpa, KA Discovery of PF-00217830: aryl piperazine napthyridinones as D2 partial agonists for schizophrenia and bipolar disorder. Bioorg Med Chem Lett 21:2621-5 (2011)  
Target
Name:
5-hydroxytryptamine receptor 1A
Synonyms:
5-HT-1A 5-hydroxytryptamine receptor 1A (5-HT-1A) ADRB2RL1 Dopamine D2 receptor and serotonin 1a receptor HTR1A | Serotonin receptor 1A
Type:
Mol. Mass.:
46122.49
Organism:
Homo sapiens (Human)
Description:
Residue:
422
  
Inhibitor
Name:
BDBM50343283
Synonyms:
7-(4-(4-(7-fluoronaphthalen-1-yl)piperazin-1-yl)butoxy)-3,4-dihydro-1,8-naphthyridin-2(1H)-one | CHEMBL1774086
Type:
Small organic molecule
Emp. Form.:
C26H29FN4O2
Mol. Mass.:
448.5325
SMILES:
Fc1ccc2cccc(N3CCN(CCCCOc4ccc5CCC(=O)Nc5n4)CC3)c2c1
: