Target
Sodium-dependent dopamine transporter
Ligand
BDBM30130
Substrate
Meas. Tech.
ChEMBL_746271 (CHEMBL1775933)
Ki
1092±n/a nM
Citation
 Gopishetty, BHazeldine, SSantra, SJohnson, MModi, GAli, SZhen, JReith, MDutta, A Further structure-activity relationship studies on 4-((((3S,6S)-6-benzhydryltetrahydro-2H-pyran-3-yl)amino)methyl)phenol: identification of compounds with triple uptake inhibitory activity as potential antidepressant agents. J Med Chem 54:2924-32 (2011)  
Target
Name:
Sodium-dependent dopamine transporter
Synonyms:
DA transporter SC6A3_RAT Sodium-dependent dopamine transporter | Sodium-dependent dopamine transporter (DAT)
Type:
Multi-pass membrane protein
Mol. Mass.:
68749.45
Organism:
Rattus norvegicus (rat)
Description:
P23977
Residue:
619
  
Inhibitor
Name:
BDBM30130
Synonyms:
CHEMBL1201082 Fluoxetin Prozac cid_62857
Type:
Small organic molecule
Emp. Form.:
C17H18F3NO
Mol. Mass.:
309.3261
SMILES:
CNCCC(Oc1ccc(cc1)C(F)(F)F)c1ccccc1
: