Target
Baculoviral IAP repeat-containing protein 3
Ligand
BDBM50343513
Substrate
Meas. Tech.
ChEMBL_746857 (CHEMBL1777140)
Ki
11±n/a nM
Citation
 Sun, HLiu, LLu, JBai, LLi, XNikolovska-Coleska, ZMcEachern, DYang, CYQiu, SYi, HSun, DWang, S Potent bivalent Smac mimetics: effect of the linker on binding to inhibitor of apoptosis proteins (IAPs) and anticancer activity. J Med Chem 54:3306-18 (2011)  
Target
Name:
Baculoviral IAP repeat-containing protein 3
Synonyms:
API2 BIRC3_HUMAN Baculoviral IAP repeat-containing protein 3 (IAP1 BIR3) MIHC XIAP-BIR3 | cIAP1/cIAP2
Type:
Protein
Mol. Mass.:
68365.75
Organism:
Homo sapiens (Human)
Description:
Q13489
Residue:
604
  
Inhibitor
Name:
BDBM50343513
Synonyms:
(3S,6S,10aS)-6-((S)-2-acetamido-3-(1H-indol-3-yl)propanamido)-N-((S)-(1-(4-(4-(4-(4-((S)-((3S,6S,10aS)-6-((S)-2-(methylamino)propanamido)-5-oxodecahydropyrrolo[1,2-a]azocine-3-carboxamido)(phenyl)methyl)-1H-1,2,3-triazol-1-yl)butyl)phenyl)butyl)-1H-1,2,3-triazol-4-yl)(phenyl)methyl)-5-oxodecahydropyrrolo[1,2-a]azocine-3-carboxamide | CHEMBL1774166
Type:
Small organic molecule
Emp. Form.:
C71H89N15O7
Mol. Mass.:
1264.5627
SMILES:
CN[C@@H](C)C(=O)N[C@H]1CCCC[C@H]2CC[C@H](N2C1=O)C(=O)N[C@H](c1cn(CCCCc2ccc(CCCCn3cc(nn3)[C@@H](NC(=O)[C@@H]3CC[C@@H]4CCCC[C@H](NC(=O)[C@H](Cc5c[nH]c6ccccc56)NC(C)=O)C(=O)N34)c3ccccc3)cc2)nn1)c1ccccc1
: