Target
Histamine H1 receptor
Ligand
BDBM50343582
Substrate
Meas. Tech.
ChEMBL_745951 (CHEMBL1775250)
IC50
195±n/a nM
Citation
 Kubota, KKurebayashi, HMiyachi, HTobe, MOnishi, MIsobe, Y Synthesis and structure-activity relationship of tricyclic carboxylic acids as novel anti-histamines. Bioorg Med Chem 19:3005-21 (2011)  
Target
Name:
Histamine H1 receptor
Synonyms:
H1R HISTAMINE H1 HRH1_HUMAN
Type:
G Protein-Coupled Receptor (GPCR)
Mol. Mass.:
55808.72
Organism:
Homo sapiens (Human)
Description:
Cell pellets from SK-N-MC cells transfected with human H1 receptor were used in binding assay.
Residue:
487
  
Inhibitor
Name:
BDBM50343582
Synonyms:
CHEMBL1774505 | [(5Z)-5-{3-[4-(1,3-Dimethyl-2,6-dioxo-1,2,3,6-tetrahydropyrimidin-4-yl)piperazin-1-yl]propylidene}-10,11-dihydro-5H-dibenzo[a,d][7]annulen-3-yl]acetic acid
Type:
Small organic molecule
Emp. Form.:
C30H34N4O4
Mol. Mass.:
514.6154
SMILES:
Cn1c(cc(=O)n(C)c1=O)N1CCN(CC\C=C2\c3ccccc3CCc3ccc(CC(O)=O)cc23)CC1
: