Target
Melatonin receptor type 1B
Ligand
BDBM50343591
Substrate
Meas. Tech.
ChEMBL_746050 (CHEMBL1775437)
Ki
0.77±n/a nM
Citation
 Koike, THoashi, YTakai, TNakayama, MYukuhiro, NIshikawa, THirai, KUchikawa, O 1,6-Dihydro-2H-indeno[5,4-b]furan derivatives: design, synthesis, and pharmacological characterization of a novel class of highly potent MT2-selective agonists. J Med Chem 54:3436-44 (2011)  
Target
Name:
Melatonin receptor type 1B
Synonyms:
MTNR1B Mel-1B-R Melatonin 1B Melatonin receptor type 1B | Melatonin receptor type 2 (MT2)
Type:
Enzyme
Mol. Mass.:
40203.54
Organism:
Homo sapiens (Human)
Description:
P49286
Residue:
362
  
Inhibitor
Name:
BDBM50343591
Synonyms:
CHEMBL1774530 | N-{2-[7-(4-tert-Butylphenyl)-1,6-dihydro-2H-indeno[5,4-b]-furan-8-yl]ethyl}acetamide
Type:
Small organic molecule
Emp. Form.:
C25H29NO2
Mol. Mass.:
375.5033
SMILES:
CC(=O)NCCC1=C(Cc2ccc3OCCc3c12)c1ccc(cc1)C(C)(C)C
: