Target
Tyrosine-protein kinase JAK2
Ligand
BDBM50343726
Substrate
Meas. Tech.
ChEMBL_746717 (CHEMBL1776842)
IC50
<1±n/a nM
Citation
 Wang, TIoannidis, SAlmeida, LBlock, MHDavies, AMLamb, MLScott, DASu, MZhang, HJAlimzhanov, MBebernitz, GBell, KZinda, M In vitro and in vivo evaluation of 6-aminopyrazolyl-pyridine-3-carbonitriles as JAK2 kinase inhibitors. Bioorg Med Chem Lett 21:2958-61 (2011)  
Target
Name:
Tyrosine-protein kinase JAK2
Synonyms:
JAK-2 JAK2_HUMAN Janus kinase 2 (JAK2) | Janus kinase 2 (a protein tyrosine kinase)
Type:
Protein
Mol. Mass.:
130684.68
Organism:
Homo sapiens (Human)
Description:
O60674
Residue:
1132
  
Inhibitor
Name:
BDBM50343726
Synonyms:
(S)-5-fluoro-2-(1-(5-fluoropyridin-2-yl)ethylamino)-6-(5-methyl-1H-pyrazol-3-ylamino)nicotinonitrile | CHEMBL1774056
Type:
Small organic molecule
Emp. Form.:
C17H15F2N7
Mol. Mass.:
355.3447
SMILES:
C[C@H](Nc1nc(Nc2cc(C)n[nH]2)c(F)cc1C#N)c1ccc(F)cn1
: