Target
Aurora kinase A
Ligand
BDBM50343947
Substrate
Meas. Tech.
ChEMBL_748278 (CHEMBL1781288)
Ki
2.3±n/a nM
Citation
 Ando, RIkegami, HSakiyama, MOoike, SHayashi, MFujino, YAbe, DNakamura, HMishina, TKato, HIwase, YTomozane, HMorioka, M 3-Cyano-6-(5-methyl-3-pyrazoloamino)pyridines: selective Aurora A kinase inhibitors. Bioorg Med Chem Lett 20:4709-11 (2010)  
Target
Name:
Aurora kinase A
Synonyms:
AIK ARK1 AURKA AYK1 Aurora kinase A (AURA) Aurora kinase A (Aurora A) Aurora-related kinase 1 BTAK Breast-tumor-amplified kinase STK15 Serine/threonine kinase 15 Serine/threonine-protein kinase aurora A hARK1
Type:
Serine/threonine-protein kinase
Mol. Mass.:
45830.98
Organism:
Homo sapiens (Human)
Description:
O14965
Residue:
403
  
Inhibitor
Name:
BDBM50343947
Synonyms:
2-(6-hydroxy-6-methylheptylamino)-4-methyl-6-(5-methyl-1H-pyrazol-3-ylamino)nicotinonitrile | CHEMBL1778661
Type:
Small organic molecule
Emp. Form.:
C19H28N6O
Mol. Mass.:
356.4652
SMILES:
Cc1cc(Nc2cc(C)c(C#N)c(NCCCCCC(C)(C)O)n2)[nH]n1
: