Target
Disintegrin and metalloproteinase domain-containing protein 10
Ligand
BDBM50342963
Substrate
Meas. Tech.
ChEMBL_748386 (CHEMBL1781550)
Ki
166±n/a nM
Citation
 Li, DPopovici-Muller, JBelanger, DBCaldwell, JDai, CDavid, MGirijavallabhan, VMLavey, BJLee, JFLiu, ZMazzola, RRizvi, RRosner, KEShankar, BSpitler, JTing, PCVaccaro, HYu, WZhou, GZhu, ZNiu, XSun, JGuo, ZOrth, PChen, SKozlowski, JALundell, DJMadison, VMcKittrick, BPiwinski, JJShih, NYShipps, GWSiddiqui, MAStrickland, CO Structure and activity relationships of tartrate-based TACE inhibitors. Bioorg Med Chem Lett 20:4812-5 (2010)  
Target
Name:
Disintegrin and metalloproteinase domain-containing protein 10
Synonyms:
ADA10_HUMAN Disintegrin and metalloproteinase domain-containing protein 10 (ADAM10) MADM
Type:
Enzyme
Mol. Mass.:
84160.93
Organism:
Homo sapiens (Human)
Description:
O14672
Residue:
748
  
Inhibitor
Name:
BDBM50342963
Synonyms:
(2R,3R)-N-((R)-1-(4-(1H-pyrazol-1-yl)phenyl)ethyl)-4-((R)-2-(3-chlorophenyl)pyrrolidin-1-yl)-2,3-dihydroxy-4-oxobutanamide | CHEMBL1770629
Type:
Small organic molecule
Emp. Form.:
C25H27ClN4O4
Mol. Mass.:
482.959
SMILES:
C[C@@H](NC(=O)[C@H](O)[C@@H](O)C(=O)N1CCC[C@@H]1c1cccc(Cl)c1)c1ccc(cc1)-n1cccn1
: