Target
Melatonin receptor type 1A
Ligand
BDBM9019
Substrate
Meas. Tech.
ChEMBL_748404 (CHEMBL1781568)
Ki
0.22±n/a nM
Citation
 Mésangeau, CFraise, MDelagrange, PCaignard, DHBoutin, JABerthelot, PYous, S Preparation and pharmacological evaluation of a novel series of 2-(phenylthio)benzo[b]thiophenes as selective MT2 receptor ligands. Eur J Med Chem 46:1835-40 (2011)  
Target
Name:
Melatonin receptor type 1A
Synonyms:
MTNR1A MTR1A_HUMAN Mel1a melatonin receptor Melatonin receptor Melatonin receptor type 1 (MT1) | Melatonin receptor type 1A
Type:
Enzyme
Mol. Mass.:
39392.94
Organism:
Homo sapiens (Human)
Description:
P48039
Residue:
350
  
Inhibitor
Name:
BDBM9019
Synonyms:
CHEMBL45 N-[2-(5-methoxy-1H-indol-3-yl)ethyl]acetamide
Type:
Small organic molecule
Emp. Form.:
C13H16N2O2
Mol. Mass.:
232.2783
SMILES:
COc1ccc2[nH]cc(CCNC(C)=O)c2c1
: