Target
Mitogen-activated protein kinase 8
Ligand
BDBM50341346
Substrate
Meas. Tech.
ChEMBL_747896 (CHEMBL1781215)
Kd
110±n/a nM
Citation
 Soth, MAbbot, SAbubakari, AArora, NArzeno, HBilledeau, RDewdney, NDurkin, KFrauchiger, SGhate, MGoldstein, DMHill, RJKuglstatter, ALi, FLoe, BMcCaleb, KMcIntosh, JPapp, EPark, JStahl, MSung, MLSuttman, RSwinney, DCWeller, PWong, BZecic, HGabriel, T 3-Amino-pyrazolo[3,4-d]pyrimidines as p38a kinase inhibitors: design and development to a highly selective lead. Bioorg Med Chem Lett 21:3452-6 (2011)  
Target
Name:
Mitogen-activated protein kinase 8
Synonyms:
JNK-46 JNK1-alpha-1 MK08_HUMAN PRKM8 SAPK1C c-Jun N-terminal kinase 1 c-Jun N-terminal kinase 1(JNK1) | c-Jun N-terminal kinase 2 (JNK2)
Type:
Enzyme
Mol. Mass.:
48297.57
Organism:
Homo sapiens (Human)
Description:
JNK-1 was purchased from Upstate Cell Signaling Solutions (formerly Upstate Biotechnology).
Residue:
427
  
Inhibitor
Name:
BDBM50341346
Synonyms:
(R)-6-(2,4-difluorophenoxy)-8-methyl-2-(1-(methylsulfonyl)propan-2-ylamino)pyrido[2,3-d]pyrimidin-7(8H)-one 6-(2,4-difluorophenoxy)-8-methyl-2-{[(1R)-1-methyl-2-(methylsulfonyl)ethyl]amino}pyrido[2,3-d]pyrimidin-7(8H)-one | CHEMBL1232769
Type:
Small organic molecule
Emp. Form.:
C18H18F2N4O4S
Mol. Mass.:
424.422
SMILES:
C[C@H](CS(C)(=O)=O)Nc1ncc2cc(Oc3ccc(F)cc3F)c(=O)n(C)c2n1
: