Target
MAP kinase-activated protein kinase 2
Ligand
BDBM50344718
Substrate
Meas. Tech.
ChEMBL_749048 (CHEMBL1780645)
EC50
8.3±n/a nM
Citation
 Kaptein, AOubrie, Ade Zwart, EHoogenboom, Nde Wit, Jvan de Kar, Bvan Hoek, MVogel, Gde Kimpe, VSchultz-Fademrecht, CBorsboom, Jvan Zeeland, MVersteegh, JKazemier, Bde Roos, JWijnands, FDulos, JJaeger, MLeandro-Garcia, PBarf, T Discovery of selective and orally available spiro-3-piperidyl ATP-competitive MK2 inhibitors. Bioorg Med Chem Lett 21:3823-7 (2011)  
Target
Name:
MAP kinase-activated protein kinase 2
Synonyms:
MAP kinase-activated protein kinase 2 (MAPKAPK2) MAP kinase-activated protein kinase 2 (p38/MK2) MAPK-activated protein kinase 2 MAPKAP kinase 2 MAPKAPK2 | MK2
Type:
Serine/threonine-protein kinase
Mol. Mass.:
45579.87
Organism:
Homo sapiens (Human)
Description:
P49137
Residue:
400
  
Inhibitor
Name:
BDBM50344718
Synonyms:
2'-(2-(3-fluorophenyl)pyrimidin-4-yl)-5',6'-dihydrospiro[piperidine-4,7'-pyrrolo[3,2-c]pyridin]-4'(1'H)-one | CHEMBL1779350
Type:
Small organic molecule
Emp. Form.:
C21H20FN5O
Mol. Mass.:
377.4148
SMILES:
Fc1cccc(c1)-c1nccc(n1)-c1cc2c([nH]1)C1(CCNCC1)CNC2=O
: