Target
MAP kinase-activated protein kinase 2
Ligand
BDBM50344729
Substrate
Meas. Tech.
ChEMBL_749048 (CHEMBL1780645)
EC50
2.1±n/a nM
Citation
 Kaptein, AOubrie, Ade Zwart, EHoogenboom, Nde Wit, Jvan de Kar, Bvan Hoek, MVogel, Gde Kimpe, VSchultz-Fademrecht, CBorsboom, Jvan Zeeland, MVersteegh, JKazemier, Bde Roos, JWijnands, FDulos, JJaeger, MLeandro-Garcia, PBarf, T Discovery of selective and orally available spiro-3-piperidyl ATP-competitive MK2 inhibitors. Bioorg Med Chem Lett 21:3823-7 (2011)  
Target
Name:
MAP kinase-activated protein kinase 2
Synonyms:
MAP kinase-activated protein kinase 2 (MAPKAPK2) MAP kinase-activated protein kinase 2 (p38/MK2) MAPK-activated protein kinase 2 MAPKAP kinase 2 MAPKAPK2 | MK2
Type:
Serine/threonine-protein kinase
Mol. Mass.:
45579.87
Organism:
Homo sapiens (Human)
Description:
P49137
Residue:
400
  
Inhibitor
Name:
BDBM50344729
Synonyms:
2'-(2'-amino-2,5'-bipyrimidin-4-yl)-5',6'-dihydrospiro[piperidine-4,7'-pyrrolo[3,2-c]pyridin]-4'(1'H)-one | CHEMBL1779366
Type:
Small organic molecule
Emp. Form.:
C19H20N8O
Mol. Mass.:
376.4151
SMILES:
Nc1ncc(cn1)-c1nccc(n1)-c1cc2c([nH]1)C1(CCNCC1)CNC2=O
: