Target
5-hydroxytryptamine receptor 1A
Ligand
BDBM50345701
Substrate
Meas. Tech.
ChEMBL_750527 (CHEMBL1786288)
Ki
350±n/a nM
Citation
 Alonso, DVázquez-Villa, HGamo, AMMartínez-Esperón, MFTortosa, MViso, AFernández de la Pradilla, RJunquera, EAicart, EMartín-Fontecha, MBenhamú, BLópez-Rodríguez, MLOrtega-Gutiérrez, S Development of Fluorescent Ligands for the Human 5-HT1A Receptor. ACS Med Chem Lett 1:249-253 (2010)  
Target
Name:
5-hydroxytryptamine receptor 1A
Synonyms:
5-HT-1A 5-hydroxytryptamine receptor 1A (5-HT-1A) ADRB2RL1 Dopamine D2 receptor and serotonin 1a receptor HTR1A | Serotonin receptor 1A
Type:
Mol. Mass.:
46122.49
Organism:
Homo sapiens (Human)
Description:
Residue:
422
  
Inhibitor
Name:
BDBM50345701
Synonyms:
5-{4-[4-(1,3-Dioxotetrahydro-1H-pyrrolo[1,2-c]imidazol-2(3H)-yl)butyl]piperazin-1-yl}-N,N-dimethylnaphthalene-1-sulfonamide | CHEMBL1784937
Type:
Small organic molecule
Emp. Form.:
C26H35N5O4S
Mol. Mass.:
513.652
SMILES:
CN(C)S(=O)(=O)c1cccc2c(cccc12)N1CCN(CCCCn2c(O)c3CCCn3c2=O)CC1
: