Target
Mitogen-activated protein kinase 14
Ligand
BDBM50099336
Substrate
Meas. Tech.
ChEMBL_749304 (CHEMBL1785239)
IC50
650±n/a nM
Citation
 Ravindra, GKAchaiah, GSastry, GN Molecular modeling studies of phenoxypyrimidinyl imidazoles as p38 kinase inhibitors using QSAR and docking. Eur J Med Chem 43:830-8 (2008)  
Target
Name:
Mitogen-activated protein kinase 14
Synonyms:
CSAID-binding protein CSBP1 CSPB1 MAP kinase 14 MAP kinase p38 alpha MAPK14 MK14_HUMAN Mitogen-activated protein kinase p38 alpha Stress-activated protein kinase 2a | p38 MAP kinase alpha/beta
Type:
Serine/threonine-protein kinase
Mol. Mass.:
41286.76
Organism:
Homo sapiens (Human)
Description:
Q16539
Residue:
360
  
Inhibitor
Name:
BDBM50099336
Synonyms:
4-[5-(4-Fluoro-phenyl)-3-piperidin-4-yl-3H-imidazol-4-yl]-2-(4-methanesulfonyl-phenoxy)-pyrimidine | CHEMBL418348
Type:
Small organic molecule
Emp. Form.:
C25H24FN5O3S
Mol. Mass.:
493.553
SMILES:
CS(=O)(=O)c1ccc(Oc2nccc(n2)-c2c(ncn2C2CCNCC2)-c2ccc(F)cc2)cc1
: