Target
Glyceraldehyde-3-phosphate dehydrogenase, glycosomal
Ligand
BDBM50345790
Substrate
Meas. Tech.
ChEMBL_749305 (CHEMBL1785240)
IC50
>250000±n/a nM
Citation
 Pereira, JMSeverino, RPVieira, PCFernandes, JBda Silva, MFZottis, AAndricopulo, ADOliva, GCorrêa, AG Anacardic acid derivatives as inhibitors of glyceraldehyde-3-phosphate dehydrogenase from Trypanosoma cruzi. Bioorg Med Chem 16:8889-95 (2008)  
Target
Name:
Glyceraldehyde-3-phosphate dehydrogenase, glycosomal
Synonyms:
G3PG_TRYCR
Type:
PROTEIN
Mol. Mass.:
39070.68
Organism:
Trypanosoma cruzi
Description:
ChEMBL_973242
Residue:
359
  
Inhibitor
Name:
BDBM50345790
Synonyms:
2-hydroxy-6-(8-hydroxyoctyl)benzoic acid | CHEMBL1784988
Type:
Small organic molecule
Emp. Form.:
C15H22O4
Mol. Mass.:
266.3328
SMILES:
OCCCCCCCCc1cccc(O)c1C(O)=O
: