Target
Glyceraldehyde-3-phosphate dehydrogenase, glycosomal
Ligand
BDBM50345793
Substrate
Meas. Tech.
ChEMBL_749309 (CHEMBL1785090)
Ki
4000±n/a nM
Citation
 Pereira, JMSeverino, RPVieira, PCFernandes, JBda Silva, MFZottis, AAndricopulo, ADOliva, GCorrêa, AG Anacardic acid derivatives as inhibitors of glyceraldehyde-3-phosphate dehydrogenase from Trypanosoma cruzi. Bioorg Med Chem 16:8889-95 (2008)  
Target
Name:
Glyceraldehyde-3-phosphate dehydrogenase, glycosomal
Synonyms:
G3PG_TRYCR
Type:
PROTEIN
Mol. Mass.:
39070.68
Organism:
Trypanosoma cruzi
Description:
ChEMBL_973242
Residue:
359
  
Inhibitor
Name:
BDBM50345793
Synonyms:
2-dodecyl-6-hydroxybenzoic acid CHEMBL451726
Type:
Small organic molecule
Emp. Form.:
C19H30O3
Mol. Mass.:
306.4397
SMILES:
CCCCCCCCCCCCc1cccc(O)c1C(O)=O
: