Target
D(2) dopamine receptor
Ligand
BDBM50346374
Substrate
Meas. Tech.
ChEMBL_749998 (CHEMBL1787136)
Ki
>10000±n/a nM
Citation
 Fiorino, FMagli, EPerissutti, ESeverino, BFrecentese, FEsposito, ADe Angelis, FIncisivo, GMMassarelli, PNencini, CDi Gennaro, EBudillon, ADi Cintio, ASantagada, VCaliendo, G Synthesis of 1-naphtylpiperazine derivatives as serotoninergic ligands and their evaluation as antiproliferative agents. Eur J Med Chem 46:2206-16 (2011)  
Target
Name:
D(2) dopamine receptor
Synonyms:
DOPAMINE D2 DOPAMINE D2 Short Dopamine D2 receptor Drd2
Type:
G Protein-Coupled Receptor (GPCR)
Mol. Mass.:
50931.60
Organism:
Rattus norvegicus (rat)
Description:
P61169
Residue:
444
  
Inhibitor
Name:
BDBM50346374
Synonyms:
3-(2-(4-(naphthalen-1-yl)piperazin-1-yl)ethyl)benzo[d][1,2,3]triazin-4(3H)-one | CHEMBL1783346
Type:
Small organic molecule
Emp. Form.:
C23H23N5O
Mol. Mass.:
385.4616
SMILES:
O=c1n(CCN2CCN(CC2)c2cccc3ccccc23)nnc2ccccc12
: