Target
Lysine-specific histone demethylase 1A
Ligand
BDBM50346535
Substrate
Meas. Tech.
ChEMBL_754037 (CHEMBL1798469)
IC50
6700±n/a nM
Citation
 Ogasawara, DSuzuki, TMino, KUeda, RKhan, MNMatsubara, TKoseki, KHasegawa, MSasaki, RNakagawa, HMizukami, TMiyata, N Synthesis and biological activity of optically active NCL-1, a lysine-specific demethylase 1 selective inhibitor. Bioorg Med Chem 19:3702-8 (2011)  
Target
Name:
Lysine-specific histone demethylase 1A
Synonyms:
AOF2 Flavin-containing amine oxidase domain-containing protein 2 KDM1A KIAA0601 Lysine-specific demethylase 1 (LSD1) Lysine-specific histone demethylase 1 (LSD1)
Type:
Enzyme
Mol. Mass.:
92901.01
Organism:
Homo sapiens (Human)
Description:
O60341
Residue:
852
  
Inhibitor
Name:
BDBM50346535
Synonyms:
CHEMBL1797706
Type:
Small organic molecule
Emp. Form.:
C27H29N3O3
Mol. Mass.:
443.5375
SMILES:
N[C@@H]1C[C@H]1c1cccc(OCC[C@H](NC(=O)c2ccccc2)C(=O)NCc2ccccc2)c1
: