Target
Phosphatidylinositol 3-kinase catalytic subunit type 3
Ligand
BDBM50346961
Substrate
Meas. Tech.
ChEMBL_753295 (CHEMBL1799506)
IC50
170±n/a nM
Citation
 Liu, QWang, JKang, SAThoreen, CCHur, WChoi, HGWaller, DLSim, TSabatini, DMGray, NS Discovery and optimization of potent and selective benzonaphthyridinone analogs as small molecule mTOR inhibitors with improved mouse microsome stability. Bioorg Med Chem Lett 21:4036-40 (2011)  
Target
Name:
Phosphatidylinositol 3-kinase catalytic subunit type 3
Synonyms:
BC033004 PIK3C3 Phosphatidylinositol 3-kinase catalytic subunit type 3 (PIK3C3) Phosphoinositide 3-Kinase (PI3K), Vps34 PtdIns-3-kinase type 3 hVPS34
Type:
Enzyme
Mol. Mass.:
101551.30
Organism:
Homo sapiens (Human)
Description:
Recombinant human Vps34 protein was expressed as monomeric GST-fusion and purified.
Residue:
887
  
Inhibitor
Name:
BDBM50346961
Synonyms:
CHEMBL1795875
Type:
Small organic molecule
Emp. Form.:
C41H32F3N5O2
Mol. Mass.:
683.7203
SMILES:
CN1CCC(CC1)NC(=O)c1ccc(cc1)-c1ccc(cc1C(F)(F)F)-n1c2c(ccc1=O)cnc1ccc(cc21)-c1cnc2ccccc2c1
: