Target
Renin
Ligand
BDBM50347012
Substrate
Meas. Tech.
ChEMBL_753402 (CHEMBL1799737)
IC50
0.400000±n/a nM
Citation
 Chen, ACampeau, LCCauchon, EChefson, ADucharme, YDubé, DFalgueyret, JPFournier, PAGagné, SGrimm, EHan, YHoule, RHuang, JQLacombe, PLaliberté, SLévesque, JFLiu, SMacDonald, DMackay, BMcKay, DPercival, MDRegan, CRegan, HSt-Jacques, RToulmond, S Renin inhibitors for the treatment of hypertension: design and optimization of a novel series of pyridone-substituted piperidines. Bioorg Med Chem Lett 21:3970-5 (2011)  
Target
Name:
Renin
Synonyms:
Angiotensinogenase RENI_HUMAN
Type:
Enzyme
Mol. Mass.:
45058.99
Organism:
Homo sapiens (Human)
Description:
Residue:
406
  
Inhibitor
Name:
BDBM50347012
Synonyms:
CHEMBL1796065
Type:
Small organic molecule
Emp. Form.:
C30H37N3O3
Mol. Mass.:
487.6331
SMILES:
COCCCc1cc(CN(C2CC2)C(=O)[C@H]2CNCC[C@@H]2c2ccn(C)c(=O)c2)c2ccccc2c1
: