Target
Potassium voltage-gated channel subfamily H member 2
Ligand
BDBM50346989
Substrate
Meas. Tech.
ChEMBL_753404 (CHEMBL1799739)
Ki
750±n/a nM
Citation
 Chen, ACampeau, LCCauchon, EChefson, ADucharme, YDubé, DFalgueyret, JPFournier, PAGagné, SGrimm, EHan, YHoule, RHuang, JQLacombe, PLaliberté, SLévesque, JFLiu, SMacDonald, DMackay, BMcKay, DPercival, MDRegan, CRegan, HSt-Jacques, RToulmond, S Renin inhibitors for the treatment of hypertension: design and optimization of a novel series of pyridone-substituted piperidines. Bioorg Med Chem Lett 21:3970-5 (2011)  
Target
Name:
Potassium voltage-gated channel subfamily H member 2
Synonyms:
1,3-beta-glucan synthase component GLS2 ERG Eag-related protein 1 Ether-a-go-go-related gene (HERG) Ether-a-go-go-related gene potassium channel 1 Ether-a-go-go-related gene potassium channel 1 (hERG1) Ether-a-go-go-related protein 1 H-ERG KCNH2 Potassium voltage-gated channel subfamily H member 2 (hERG) Voltage-gated potassium channel subunit Kv11.1 hERG Potassium Channel 1 | putative potassium channel subunit
Type:
Multi-pass membrane protein
Mol. Mass.:
126672.65
Organism:
Homo sapiens (Human)
Description:
Q12809
Residue:
1159
  
Inhibitor
Name:
BDBM50346989
Synonyms:
CHEMBL1796075
Type:
Small organic molecule
Emp. Form.:
C31H32F2N4O2
Mol. Mass.:
530.6082
SMILES:
Cn1ccc(cc1=O)[C@H]1CCNC[C@@H]1C(=O)N(Cc1cn(Cc2ccc(F)cc2)c2cccc(F)c12)C1CC1
: