Target
Potassium voltage-gated channel subfamily H member 2
Ligand
BDBM50346995
Substrate
Meas. Tech.
ChEMBL_753404 (CHEMBL1799739)
Ki
8400±n/a nM
Citation
 Chen, ACampeau, LCCauchon, EChefson, ADucharme, YDubé, DFalgueyret, JPFournier, PAGagné, SGrimm, EHan, YHoule, RHuang, JQLacombe, PLaliberté, SLévesque, JFLiu, SMacDonald, DMackay, BMcKay, DPercival, MDRegan, CRegan, HSt-Jacques, RToulmond, S Renin inhibitors for the treatment of hypertension: design and optimization of a novel series of pyridone-substituted piperidines. Bioorg Med Chem Lett 21:3970-5 (2011)  
Target
Name:
Potassium voltage-gated channel subfamily H member 2
Synonyms:
1,3-beta-glucan synthase component GLS2 ERG Eag-related protein 1 Ether-a-go-go-related gene (HERG) Ether-a-go-go-related gene potassium channel 1 Ether-a-go-go-related gene potassium channel 1 (hERG1) Ether-a-go-go-related protein 1 H-ERG KCNH2 Potassium voltage-gated channel subfamily H member 2 (hERG) Voltage-gated potassium channel subunit Kv11.1 hERG Potassium Channel 1 | putative potassium channel subunit
Type:
Multi-pass membrane protein
Mol. Mass.:
126672.65
Organism:
Homo sapiens (Human)
Description:
Q12809
Residue:
1159
  
Inhibitor
Name:
BDBM50346995
Synonyms:
CHEMBL1795913
Type:
Small organic molecule
Emp. Form.:
C26H30Cl2N4O2
Mol. Mass.:
501.448
SMILES:
Cn1ccc(cc1=O)[C@H]1CCNC[C@@H]1C(=O)N(Cc1cc(CCCC#N)cc(Cl)c1Cl)C1CC1
: