Target
Prostaglandin G/H synthase 1
Ligand
BDBM50347158
Substrate
Meas. Tech.
ChEMBL_753438 (CHEMBL1799868)
IC50
>100000±n/a nM
Citation
 Abdellatif, KRHuang, ZChowdhury, MAKaufman, SKnaus, EE A diazen-1-ium-1,2-diolated nitric oxide donor ester prodrug of 3-(4-hydroxymethylphenyl)-4-(4-methanesulfonylphenyl)-5H-furan-2-one: synthesis, biological evaluation and nitric oxide release studies. Bioorg Med Chem Lett 21:3951-6 (2011)  
Target
Name:
Prostaglandin G/H synthase 1
Synonyms:
COX1 Cyclooxygenase-1 (COX-1) PTGS1 | Prostaglandin G/H synthase (cyclooxygenase)
Type:
Protein
Mol. Mass.:
68868.60
Organism:
Ovis aries (Sheep)
Description:
Residue:
600
  
Inhibitor
Name:
BDBM50347158
Synonyms:
CHEMBL1797512
Type:
Small organic molecule
Emp. Form.:
C26H27N3O10S
Mol. Mass.:
573.572
SMILES:
CC(=O)OCO\N=[N+](\[O-])N1CCC[C@@H]1C(=O)OCc1ccc(cc1)C1=C(COC1=O)c1ccc(cc1)S(C)(=O)=O
: