Target
Type 1 fimbrin D-mannose specific adhesin
Ligand
BDBM50347459
Substrate
Meas. Tech.
ChEMBL_755504 (CHEMBL1805065)
IC50
38.7±n/a nM
Citation
 Klein, TAbgottspon, DWittwer, MRabbani, SHerold, JJiang, XKleeb, SLüthi, CScharenberg, MBezençon, JGubler, EPang, LSmiesko, MCutting, BSchwardt, OErnst, B FimH antagonists for the oral treatment of urinary tract infections: from design and synthesis to in vitro and in vivo evaluation. J Med Chem 53:8627-41 (2010)  
Target
Name:
Type 1 fimbrin D-mannose specific adhesin
Synonyms:
Adhesin protein fimH fimH
Type:
PROTEIN
Mol. Mass.:
31474.61
Organism:
Escherichia coli (strain K12)
Description:
ChEMBL_1298296
Residue:
300
  
Inhibitor
Name:
BDBM50347459
Synonyms:
CHEMBL1802193
Type:
Small organic molecule
Emp. Form.:
C19H19O8
Mol. Mass.:
375.3499
SMILES:
OC[C@H]1O[C@H](Oc2cccc(c2)-c2ccc(cc2)C([O-])=O)[C@@H](O)[C@@H](O)[C@@H]1O
: