Target
Type 1 fimbiral adhesin FimH
Ligand
BDBM50347457
Substrate
Meas. Tech.
ChEMBL_755506 (CHEMBL1805067)
IC50
17000±n/a nM
Citation
 Klein, TAbgottspon, DWittwer, MRabbani, SHerold, JJiang, XKleeb, SLüthi, CScharenberg, MBezençon, JGubler, EPang, LSmiesko, MCutting, BSchwardt, OErnst, B FimH antagonists for the oral treatment of urinary tract infections: from design and synthesis to in vitro and in vivo evaluation. J Med Chem 53:8627-41 (2010)  
Target
Name:
Type 1 fimbiral adhesin FimH
Synonyms:
Type:
PROTEIN
Mol. Mass.:
31430.55
Organism:
Escherichia coli (strain UTI89 / UPEC)
Description:
ChEMBL_755506
Residue:
300
  
Inhibitor
Name:
BDBM50347457
Synonyms:
CHEMBL1802189
Type:
Small organic molecule
Emp. Form.:
C19H18ClO8
Mol. Mass.:
409.795
SMILES:
OC[C@H]1O[C@H](Oc2ccc(c(Cl)c2)-c2ccc(cc2)C([O-])=O)[C@@H](O)[C@@H](O)[C@@H]1O
: