Target
Type 1 fimbiral adhesin FimH
Ligand
BDBM50347454
Substrate
Meas. Tech.
ChEMBL_755506 (CHEMBL1805067)
IC50
33000±n/a nM
Citation
 Klein, TAbgottspon, DWittwer, MRabbani, SHerold, JJiang, XKleeb, SLüthi, CScharenberg, MBezençon, JGubler, EPang, LSmiesko, MCutting, BSchwardt, OErnst, B FimH antagonists for the oral treatment of urinary tract infections: from design and synthesis to in vitro and in vivo evaluation. J Med Chem 53:8627-41 (2010)  
Target
Name:
Type 1 fimbiral adhesin FimH
Synonyms:
Type:
PROTEIN
Mol. Mass.:
31430.55
Organism:
Escherichia coli (strain UTI89 / UPEC)
Description:
ChEMBL_755506
Residue:
300
  
Inhibitor
Name:
BDBM50347454
Synonyms:
CHEMBL1171678
Type:
Small organic molecule
Emp. Form.:
C20H22O8
Mol. Mass.:
390.3839
SMILES:
COC(=O)c1ccc(cc1)-c1cccc(OC2OC(CO)C(O)C(O)C2O)c1
: