Target
1-deoxy-D-xylulose 5-phosphate reductoisomerase
Ligand
BDBM50153713
Substrate
Meas. Tech.
ChEMBL_755773 (CHEMBL1803440)
Ki
140±n/a nM
Citation
 Deng, LDiao, JChen, PPujari, VYao, YCheng, GCrick, DCPrasad, BVSong, Y Inhibition of 1-deoxy-D-xylulose-5-phosphate reductoisomerase by lipophilic phosphonates: SAR, QSAR, and crystallographic studies. J Med Chem 54:4721-34 (2011)  
Target
Name:
1-deoxy-D-xylulose 5-phosphate reductoisomerase
Synonyms:
DXR_MYCTU | dxr
Type:
PROTEIN
Mol. Mass.:
42846.92
Organism:
Mycobacterium tuberculosis
Description:
ChEMBL_1474510
Residue:
413
  
Inhibitor
Name:
BDBM50153713
Synonyms:
3-(N-hydroxyformamido)propylphosphonic acid CHEMBL203125 fosmidomycin
Type:
Small organic molecule
Emp. Form.:
C4H10NO5P
Mol. Mass.:
183.0997
SMILES:
ON(CCCP(O)(O)=O)C=O
: