Target
Melatonin receptor type 1B
Ligand
BDBM50343599
Substrate
Meas. Tech.
ChEMBL_755972 (CHEMBL1803862)
Ki
0.0065±n/a nM
Citation
 Koike, TTakai, THoashi, YNakayama, MKosugi, YNakashima, MYoshikubo, SHirai, KUchikawa, O Synthesis of a novel series of tricyclic dihydrofuran derivatives: discovery of 8,9-dihydrofuro[3,2-c]pyrazolo[1,5-a]pyridines as melatonin receptor (MT1/MT2) ligands. J Med Chem 54:4207-18 (2011)  
Target
Name:
Melatonin receptor type 1B
Synonyms:
MTNR1B Mel-1B-R Melatonin 1B Melatonin receptor type 1B | Melatonin receptor type 2 (MT2)
Type:
Enzyme
Mol. Mass.:
40203.54
Organism:
Homo sapiens (Human)
Description:
P49286
Residue:
362
  
Inhibitor
Name:
BDBM50343599
Synonyms:
CHEMBL1774522 | N-[2-(7-Phenyl-1,6-dihydro-2H-indeno[5,4-b]furan-8-yl)-ethyl]acetamide
Type:
Small organic molecule
Emp. Form.:
C21H21NO2
Mol. Mass.:
319.3969
SMILES:
CC(=O)NCCC1=C(Cc2ccc3OCCc3c12)c1ccccc1
: