Target
Kinesin-like protein KIF11
Ligand
BDBM50322579
Substrate
Meas. Tech.
ChEMBL_756746 (CHEMBL1805292)
IC50
210±n/a nM
Citation
 Takeuchi, TOishi, SWatanabe, TOhno, HSawada, JMatsuno, KAsai, AAsada, NKitaura, KFujii, N Structure-activity relationships of carboline and carbazole derivatives as a novel class of ATP-competitive kinesin spindle protein inhibitors. J Med Chem 54:4839-46 (2011)  
Target
Name:
Kinesin-like protein KIF11
Synonyms:
EG5 KIF11_HUMAN Kinesin Spindle Protein Eg5 TRIP5 | kinesin spindle protein
Type:
PROTEIN
Mol. Mass.:
119138.97
Organism:
Homo sapiens (Human)
Description:
ChEMBL_1457426
Residue:
1056
  
Inhibitor
Name:
BDBM50322579
Synonyms:
2-(trifluoromethyl)-9H-carbazole | CHEMBL1173704
Type:
Small organic molecule
Emp. Form.:
C13H8F3N
Mol. Mass.:
235.2045
SMILES:
FC(F)(F)c1ccc2c(c1)[nH]c1ccccc21
: