Target
Kinesin-like protein KIF11
Ligand
BDBM50347612
Substrate
Meas. Tech.
ChEMBL_756746 (CHEMBL1805292)
IC50
84±n/a nM
Citation
 Takeuchi, TOishi, SWatanabe, TOhno, HSawada, JMatsuno, KAsai, AAsada, NKitaura, KFujii, N Structure-activity relationships of carboline and carbazole derivatives as a novel class of ATP-competitive kinesin spindle protein inhibitors. J Med Chem 54:4839-46 (2011)  
Target
Name:
Kinesin-like protein KIF11
Synonyms:
EG5 KIF11_HUMAN Kinesin Spindle Protein Eg5 TRIP5 | kinesin spindle protein
Type:
PROTEIN
Mol. Mass.:
119138.97
Organism:
Homo sapiens (Human)
Description:
ChEMBL_1457426
Residue:
1056
  
Inhibitor
Name:
BDBM50347612
Synonyms:
CHEMBL1803016
Type:
Small organic molecule
Emp. Form.:
C16H11F3N2O
Mol. Mass.:
304.2665
SMILES:
FC(F)(F)c1ccc2c(c1)[nH]c1ccc3NC(=O)CCc3c21
: