Target
Dual specificity tyrosine-phosphorylation-regulated kinase 1A
Ligand
BDBM50347745
Substrate
Meas. Tech.
ChEMBL_756286 (CHEMBL1805099)
IC50
170±n/a nM
Citation
 Debdab, MCarreaux, FRenault, SSoundararajan, MFedorov, OFilippakopoulos, PLozach, OBabault, LTahtouh, TBaratte, BOgawa, YHagiwara, MEisenreich, ARauch, UKnapp, SMeijer, LBazureau, JP Leucettines, a class of potent inhibitors of cdc2-like kinases and dual specificity, tyrosine phosphorylation regulated kinases derived from the marine sponge leucettamine B: modulation of alternative pre-RNA splicing. J Med Chem 54:4172-86 (2011)  
Target
Name:
Dual specificity tyrosine-phosphorylation-regulated kinase 1A
Synonyms:
DYR1A_RAT Dual-specificity tyrosine-(Y)-phosphorylation regulated kinase 1A Dyrk1a
Type:
Enzyme Catalytic Domain
Mol. Mass.:
85573.59
Organism:
RAT
Description:
Dual-specificity tyrosine-(Y)-phosphorylation regulated kinase 1A 0 RAT::Q63470
Residue:
763
  
Inhibitor
Name:
BDBM50347745
Synonyms:
CHEMBL1803084
Type:
Small organic molecule
Emp. Form.:
C18H15N3O3
Mol. Mass.:
321.33
SMILES:
Cc1ccc(NC2=NC(=Cc3ccc4OCOc4c3)C(=O)N2)cc1
: