Target
Dual specificity tyrosine-phosphorylation-regulated kinase 2
Ligand
BDBM50347749
Substrate
Meas. Tech.
ChEMBL_756287 (CHEMBL1805100)
IC50
110±n/a nM
Citation
 Debdab, MCarreaux, FRenault, SSoundararajan, MFedorov, OFilippakopoulos, PLozach, OBabault, LTahtouh, TBaratte, BOgawa, YHagiwara, MEisenreich, ARauch, UKnapp, SMeijer, LBazureau, JP Leucettines, a class of potent inhibitors of cdc2-like kinases and dual specificity, tyrosine phosphorylation regulated kinases derived from the marine sponge leucettamine B: modulation of alternative pre-RNA splicing. J Med Chem 54:4172-86 (2011)  
Target
Name:
Dual specificity tyrosine-phosphorylation-regulated kinase 2
Synonyms:
DYRK2 Dual-specificity tyrosine-phosphorylation regulated kinase 2
Type:
PROTEIN
Mol. Mass.:
66690.69
Organism:
Homo sapiens (Human)
Description:
ChEMBL_1508025
Residue:
601
  
Inhibitor
Name:
BDBM50347749
Synonyms:
CHEMBL1802357
Type:
Small organic molecule
Emp. Form.:
C19H15N3O5
Mol. Mass.:
365.3395
SMILES:
O=C1NC(Nc2ccc3OCCOc3c2)=NC1=Cc1ccc2OCOc2c1
: