Target
Dual specificity protein kinase CLK1
Ligand
BDBM50347744
Substrate
Meas. Tech.
ChEMBL_756288 (CHEMBL1805101)
IC50
83±n/a nM
Citation
 Debdab, MCarreaux, FRenault, SSoundararajan, MFedorov, OFilippakopoulos, PLozach, OBabault, LTahtouh, TBaratte, BOgawa, YHagiwara, MEisenreich, ARauch, UKnapp, SMeijer, LBazureau, JP Leucettines, a class of potent inhibitors of cdc2-like kinases and dual specificity, tyrosine phosphorylation regulated kinases derived from the marine sponge leucettamine B: modulation of alternative pre-RNA splicing. J Med Chem 54:4172-86 (2011)  
Target
Name:
Dual specificity protein kinase CLK1
Synonyms:
CDC-like kinase 1 Clk Protein kinase STY | Sty
Type:
PROTEIN
Mol. Mass.:
57124.52
Organism:
Mus musculus
Description:
ChEMBL_1502245
Residue:
483
  
Inhibitor
Name:
BDBM50347744
Synonyms:
CHEMBL1803083
Type:
Small organic molecule
Emp. Form.:
C15H15N3O3
Mol. Mass.:
285.2979
SMILES:
O=C1NC(NCC2CC2)=NC1=Cc1ccc2OCOc2c1
: