Target
Dual specificity protein kinase CLK1
Ligand
BDBM50312212
Substrate
Meas. Tech.
ChEMBL_756288 (CHEMBL1805101)
IC50
190±n/a nM
Citation
 Debdab, MCarreaux, FRenault, SSoundararajan, MFedorov, OFilippakopoulos, PLozach, OBabault, LTahtouh, TBaratte, BOgawa, YHagiwara, MEisenreich, ARauch, UKnapp, SMeijer, LBazureau, JP Leucettines, a class of potent inhibitors of cdc2-like kinases and dual specificity, tyrosine phosphorylation regulated kinases derived from the marine sponge leucettamine B: modulation of alternative pre-RNA splicing. J Med Chem 54:4172-86 (2011)  
Target
Name:
Dual specificity protein kinase CLK1
Synonyms:
CDC-like kinase 1 Clk Protein kinase STY | Sty
Type:
PROTEIN
Mol. Mass.:
57124.52
Organism:
Mus musculus
Description:
ChEMBL_1502245
Residue:
483
  
Inhibitor
Name:
BDBM50312212
Synonyms:
(5Z)-5-[(1,3-benzodioxo-5-yl)methylene]-3-methyl-2-[(2-aminoethyl)amino]-3,5-dihydro-4H-imidazol-4-onehydrochloride CHEMBL1179821
Type:
Small organic molecule
Emp. Form.:
C14H16N4O3
Mol. Mass.:
288.3018
SMILES:
CN1C(=O)C(=Cc2ccc3OCOc3c2)N=C1NCCN
: