Target
Dual specificity tyrosine-phosphorylation-regulated kinase 1A
Ligand
BDBM50347803
Substrate
Meas. Tech.
ChEMBL_756466 (CHEMBL1804241)
IC50
95±n/a nM
Citation
 Giraud, FAlves, GDebiton, ENauton, LThéry, VDurieu, EFerandin, YLozach, OMeijer, LAnizon, FPereira, EMoreau, P Synthesis, protein kinase inhibitory potencies, and in vitro antiproliferative activities of meridianin derivatives. J Med Chem 54:4474-89 (2011)  
Target
Name:
Dual specificity tyrosine-phosphorylation-regulated kinase 1A
Synonyms:
DYR1A_RAT Dual-specificity tyrosine-(Y)-phosphorylation regulated kinase 1A Dyrk1a
Type:
Enzyme Catalytic Domain
Mol. Mass.:
85573.59
Organism:
RAT
Description:
Dual-specificity tyrosine-(Y)-phosphorylation regulated kinase 1A 0 RAT::Q63470
Residue:
763
  
Inhibitor
Name:
BDBM50347803
Synonyms:
CHEMBL1802404
Type:
Small organic molecule
Emp. Form.:
C12H8IN5O2
Mol. Mass.:
381.1287
SMILES:
Nc1ncc(I)c(n1)-c1c[nH]c2cc(ccc12)[N+]([O-])=O
: