Target
Cannabinoid receptor 1
Ligand
BDBM26144
Substrate
Meas. Tech.
ChEMBL_757147 (CHEMBL1803287)
Ki
480±n/a nM
Citation
 Martín-Couce, LMartín-Fontecha, MCapolicchio, SLópez-Rodríguez, MLOrtega-Gutiérrez, S Development of endocannabinoid-based chemical probes for the study of cannabinoid receptors. J Med Chem 54:5265-9 (2011)  
Target
Name:
Cannabinoid receptor 1
Synonyms:
CANN6 CB-R CNR CNR1_HUMAN Cannabinoid receptor Cannabinoid receptor 1 (brain)
Type:
G Protein-Coupled Receptor (GPCR)
Mol. Mass.:
52868.96
Organism:
Homo sapiens (Human)
Description:
P21554
Residue:
472
  
Inhibitor
Name:
BDBM26144
Synonyms:
1,3-dihydroxypropan-2-yl (5Z,8Z,11Z,14Z)-icosa-5,8,11,14-tetraenoate 2-arachidonoylglycerol (2-AG) CHEMBL122972
Type:
Endocannabinoids
Emp. Form.:
C23H38O4
Mol. Mass.:
378.5454
SMILES:
CCCCC\C=C/C\C=C/C\C=C/C\C=C/CCCC(=O)OC(CO)CO
: