Target
Cannabinoid receptor 1
Ligand
BDBM50348141
Substrate
Meas. Tech.
ChEMBL_757147 (CHEMBL1803287)
Ki
221±n/a nM
Citation
 Martín-Couce, LMartín-Fontecha, MCapolicchio, SLópez-Rodríguez, MLOrtega-Gutiérrez, S Development of endocannabinoid-based chemical probes for the study of cannabinoid receptors. J Med Chem 54:5265-9 (2011)  
Target
Name:
Cannabinoid receptor 1
Synonyms:
CANN6 CB-R CNR CNR1_HUMAN Cannabinoid receptor Cannabinoid receptor 1 (brain)
Type:
G Protein-Coupled Receptor (GPCR)
Mol. Mass.:
52868.96
Organism:
Homo sapiens (Human)
Description:
P21554
Residue:
472
  
Inhibitor
Name:
BDBM50348141
Synonyms:
CHEMBL1800731
Type:
Small organic molecule
Emp. Form.:
C39H65N3O6S
Mol. Mass.:
704.015
SMILES:
CCCCC\C=C/C\C=C/C\C=C/C\C=C/CCCCOC(CO)COC(=O)CCCCCNC(=O)CCCC[C@@H]1SC[C@@H]2NC(=O)N[C@H]12
: