Target
Histone deacetylase 9
Ligand
BDBM50348374
Substrate
Meas. Tech.
ChEMBL_757641 (CHEMBL1805036)
IC50
>100000±n/a nM
Citation
 Kemp, MMWang, QFuller, JHWest, NMartinez, NMMorse, EMWeïwer, MSchreiber, SLBradner, JEKoehler, AN A novel HDAC inhibitor with a hydroxy-pyrimidine scaffold. Bioorg Med Chem Lett 21:4164-9 (2011)  
Target
Name:
Histone deacetylase 9
Synonyms:
HD9 HDAC7B HDAC9_HUMAN Histone acetylase 9 (HDAC9) Histone deacetylase 9 (HDAC9) Human HDAC9 MITR
Type:
Enzyme
Mol. Mass.:
111304.31
Organism:
Homo sapiens (Human)
Description:
Q9UKV0
Residue:
1011
  
Inhibitor
Name:
BDBM50348374
Synonyms:
CHEMBL1307946
Type:
Small organic molecule
Emp. Form.:
C14H14N2O3S
Mol. Mass.:
290.338
SMILES:
COc1ccc(cc1)C(=O)CSc1nc(C)cc(=O)[nH]1
: