Target
Histone deacetylase 1
Ligand
BDBM50348375
Substrate
Meas. Tech.
ChEMBL_757633 (CHEMBL1804890)
IC50
>100000±n/a nM
Citation
 Kemp, MMWang, QFuller, JHWest, NMartinez, NMMorse, EMWeïwer, MSchreiber, SLBradner, JEKoehler, AN A novel HDAC inhibitor with a hydroxy-pyrimidine scaffold. Bioorg Med Chem Lett 21:4164-9 (2011)  
Target
Name:
Histone deacetylase 1
Synonyms:
Cereblon/Histone deacetylase 1 HDAC1 Histone deacetylase 1 (HDAC1) RPD3L1
Type:
Enzyme
Mol. Mass.:
55090.27
Organism:
Homo sapiens (Human)
Description:
Q13547
Residue:
482
  
Inhibitor
Name:
BDBM50348375
Synonyms:
CHEMBL1800374
Type:
Small organic molecule
Emp. Form.:
C17H20N2O2S
Mol. Mass.:
316.418
SMILES:
Cc1cc(=O)[nH]c(SCC(=O)c2ccc(cc2)C(C)(C)C)n1
: