Target
Histone deacetylase 3
Ligand
BDBM50348375
Substrate
Meas. Tech.
ChEMBL_757635 (CHEMBL1804892)
IC50
>100000±n/a nM
Citation
 Kemp, MMWang, QFuller, JHWest, NMartinez, NMMorse, EMWeïwer, MSchreiber, SLBradner, JEKoehler, AN A novel HDAC inhibitor with a hydroxy-pyrimidine scaffold. Bioorg Med Chem Lett 21:4164-9 (2011)  
Target
Name:
Histone deacetylase 3
Synonyms:
HD3 HDAC3_HUMAN Human HDAC3 SMAP45
Type:
Enzyme
Mol. Mass.:
48829.55
Organism:
Homo sapiens (Human)
Description:
O15379
Residue:
428
  
Inhibitor
Name:
BDBM50348375
Synonyms:
CHEMBL1800374
Type:
Small organic molecule
Emp. Form.:
C17H20N2O2S
Mol. Mass.:
316.418
SMILES:
Cc1cc(=O)[nH]c(SCC(=O)c2ccc(cc2)C(C)(C)C)n1
: