Target
Beta-2 adrenergic receptor
Ligand
BDBM50348430
Substrate
Meas. Tech.
ChEMBL_755353 (CHEMBL1804509)
Ki
280±n/a nM
Citation
 Jozwiak, KWoo, AYTanga, MJToll, LJimenez, LKozocas, JAPlazinska, AXiao, RPWainer, IW Comparative molecular field analysis of fenoterol derivatives: A platform towards highly selective and effective beta(2)-adrenergic receptor agonists. Bioorg Med Chem 18:728-36 (2010)  
Target
Name:
Beta-2 adrenergic receptor
Synonyms:
ADRB2 ADRB2_HUMAN Beta-2 adrenoceptor | Beta-2 adrenoreceptor
Type:
Mol. Mass.:
46461.69
Organism:
Homo sapiens (Human)
Description:
P07550
Residue:
413
  
Inhibitor
Name:
BDBM50348430
Synonyms:
CHEMBL1800963 | US9492405, 44
Type:
Small organic molecule
Emp. Form.:
C22H25NO4
Mol. Mass.:
367.4382
SMILES:
COc1ccc(C[C@@H](C)NC[C@H](O)c2cc(O)cc(O)c2)c2ccccc12
: