Target
Beta-2 adrenergic receptor
Ligand
BDBM50213106
Substrate
Meas. Tech.
ChEMBL_755357 (CHEMBL1804513)
EC50
575±n/a nM
Citation
 Jozwiak, KWoo, AYTanga, MJToll, LJimenez, LKozocas, JAPlazinska, AXiao, RPWainer, IW Comparative molecular field analysis of fenoterol derivatives: A platform towards highly selective and effective beta(2)-adrenergic receptor agonists. Bioorg Med Chem 18:728-36 (2010)  
Target
Name:
Beta-2 adrenergic receptor
Synonyms:
ADRB2_RAT Adrb2r | Adrenergic receptor beta
Type:
PROTEIN
Mol. Mass.:
46896.26
Organism:
Rattus norvegicus
Description:
ChEMBL_38603
Residue:
418
  
Inhibitor
Name:
BDBM50213106
Synonyms:
(R,S)-(-)-fenoterol US10617654, Compound (R,S)-1 US9492405, 29
Type:
Small organic molecule
Emp. Form.:
C17H21NO4
Mol. Mass.:
303.3529
SMILES:
C[C@@H](Cc1ccc(O)cc1)NC[C@H](O)c1cc(O)cc(O)c1
: