Target
Nitric oxide synthase, brain
Ligand
BDBM50348729
Substrate
Meas. Tech.
ChEMBL_754921 (CHEMBL1806043)
EC50
2000±n/a nM
Citation
 Payne, JEBonnefous, CSymons, KTNguyen, PMSablad, MRozenkrants, NZhang, YWang, LYazdani, NShiau, AKNoble, SARix, PRao, TSHassig, CASmith, ND Discovery of dual inducible/neuronal nitric oxide synthase (iNOS/nNOS) inhibitor development candidate 4-((2-cyclobutyl-1H-imidazo[4,5-b]pyrazin-1-yl)methyl)-7,8-difluoroquinolin-2(1H)-one (KD7332) part 2: identification of a novel, potent, and selective series of benzimidazole-quinolinone iNOS/nNO J Med Chem 53:7739-55 (2010)  
Target
Name:
Nitric oxide synthase, brain
Synonyms:
Constitutive NOS NC-NOS NOS type I nNOS NOS1_HUMAN Neuronal nitric oxide synthase Nitric oxide synthase, neuronal (nNOS) bNOS | nNOS
Type:
Homodimer
Mol. Mass.:
160985.98
Organism:
Homo sapiens (Human)
Description:
P29475
Residue:
1434
  
Inhibitor
Name:
BDBM50348729
Synonyms:
CHEMBL1801503
Type:
Small organic molecule
Emp. Form.:
C21H15F5N4O
Mol. Mass.:
434.362
SMILES:
Fc1ccc2c(Cn3c(nc4c(ccnc34)C(F)(F)F)C3CCC3)cc(=O)[nH]c2c1F
: