Target
Transmembrane protease serine 11D
Ligand
BDBM50349333
Substrate
Meas. Tech.
ChEMBL_760105 (CHEMBL1810428)
Ki
17±n/a nM
Citation
 Sielaff, FBöttcher-Friebertshäuser, EMeyer, DSaupe, SMVolk, IMGarten, WSteinmetzer, T Development of substrate analogue inhibitors for the human airway trypsin-like protease HAT. Bioorg Med Chem Lett 21:4860-4 (2011)  
Target
Name:
Transmembrane protease serine 11D
Synonyms:
Airway trypsin-like protease TM11D_HUMAN Transmembrane protease serine 11D catalytic chain | Transmembrane protease serine 11D non-catalytic chain
Type:
PROTEIN
Mol. Mass.:
46272.53
Organism:
Homo sapiens (Human)
Description:
ChEMBL_840134
Residue:
418
  
Inhibitor
Name:
BDBM50349333
Synonyms:
CHEMBL1809238
Type:
Small organic molecule
Emp. Form.:
C33H41N9O5S
Mol. Mass.:
675.801
SMILES:
NC(=N)c1ccc(CNC(=O)[C@@H]2CCCN2C(=O)[C@@H](CCC(=O)N2CCN(CC2)c2ncccn2)NS(=O)(=O)Cc2ccccc2)cc1
: