Target
Transmembrane protease serine 11D
Ligand
BDBM50349344
Substrate
Meas. Tech.
ChEMBL_760105 (CHEMBL1810428)
Ki
14±n/a nM
Citation
 Sielaff, FBöttcher-Friebertshäuser, EMeyer, DSaupe, SMVolk, IMGarten, WSteinmetzer, T Development of substrate analogue inhibitors for the human airway trypsin-like protease HAT. Bioorg Med Chem Lett 21:4860-4 (2011)  
Target
Name:
Transmembrane protease serine 11D
Synonyms:
Airway trypsin-like protease TM11D_HUMAN Transmembrane protease serine 11D catalytic chain | Transmembrane protease serine 11D non-catalytic chain
Type:
PROTEIN
Mol. Mass.:
46272.53
Organism:
Homo sapiens (Human)
Description:
ChEMBL_840134
Residue:
418
  
Inhibitor
Name:
BDBM50349344
Synonyms:
CHEMBL1809250
Type:
Small organic molecule
Emp. Form.:
C24H35N7O3S
Mol. Mass.:
501.645
SMILES:
[#6]-[#6]-[#6](-[#7]-[#6]-c1ccc(cc1)-[#6](-[#7])=[#7])-[#6](=O)-[#6@@H](-[#6]-[#6]-[#6]\[#7]=[#6](\[#7])-[#7])-[#7]S(=O)(=O)[#6]-c1ccccc1
: