Target
Prothrombin
Ligand
BDBM50324475
Substrate
Meas. Tech.
ChEMBL_760106 (CHEMBL1810429)
Ki
3.5±n/a nM
Citation
 Sielaff, FBöttcher-Friebertshäuser, EMeyer, DSaupe, SMVolk, IMGarten, WSteinmetzer, T Development of substrate analogue inhibitors for the human airway trypsin-like protease HAT. Bioorg Med Chem Lett 21:4860-4 (2011)  
Target
Name:
Prothrombin
Synonyms:
Activation peptide fragment 1 Coagulation factor II Prothrombin precursor Thrombin heavy chain | Thrombin light chain
Type:
Protein
Mol. Mass.:
70029.57
Organism:
Homo sapiens (Human)
Description:
P00734
Residue:
622
  
Inhibitor
Name:
BDBM50324475
Synonyms:
Benzylsulfonyl-D-argininyl-proline-(4-amidinobenzyl)amide Bis-(trifluoroacetate) CHEMBL1229259
Type:
Small organic molecule
Emp. Form.:
C26H36N8O4S
Mol. Mass.:
556.68
SMILES:
NC(=N)NCCC[C@@H](NS(=O)(=O)Cc1ccccc1)C(=O)N1CCC[C@H]1C(=O)NCc1ccc(cc1)C(N)=N
: